Target
Carbonic anhydrase 7
Ligand
BDBM10882
Substrate
Meas. Tech.
ChEMBL_1281628 (CHEMBL3102438)
Ki
0.800000±n/a nM
Citation
 De Luca, LFerro, SDamiano, FMSupuran, CTVullo, DChimirri, AGitto, R Structure-based screening for the discovery of new carbonic anhydrase VII inhibitors. Eur J Med Chem 71:105-11 (2014)  
Target
Name:
Carbonic anhydrase 7
Synonyms:
CA-VII CAH7_HUMAN Carbonic anhydrase Carbonic anhydrase VII (CA VII)
Type:
Enzyme
Mol. Mass.:
29664.11
Organism:
Homo sapiens (Human)
Description:
Human cloned isozyme.
Residue:
264
  
Inhibitor
Name:
BDBM10882
Synonyms:
6-ethoxy-1,3-benzothiazole-2-sulfonamide Ethamide Ethoxzolamide Ethoxzolamide, EZM US10172837, Ethoxyzolamide | sulfonamide 3
Type:
Small organic molecule
Emp. Form.:
C9H10N2O3S2
Mol. Mass.:
258.317
SMILES:
CCOc1ccc2nc(sc2c1)S(N)(=O)=O
: