Target
Receptor tyrosine-protein kinase erbB-2
Ligand
BDBM50174539
Substrate
Meas. Tech.
ChEMBL_1282411 (CHEMBL3100590)
IC50
10800±n/a nM
Citation
 Sridhar, JSfondouris, MEBratton, MRNguyen, TLTownley, IKlein Stevens, CLJones, FE Identification of quinones as HER2 inhibitors for the treatment of trastuzumab resistant breast cancer. Bioorg Med Chem Lett 24:126-31 (2014)  
Target
Name:
Receptor tyrosine-protein kinase erbB-2
Synonyms:
2.7.10.1 CD_antigen=CD340 ERBB2_HUMAN FASN/HER2 HER2 MLN19 NEU Proto-oncogene Neu Tyrosine kinase-type cell surface receptor HER2 | p185erbB2
Type:
Mol. Mass.:
137894.47
Organism:
Homo sapiens (Human)
Description:
P04626
Residue:
1255
  
Inhibitor
Name:
BDBM50174539
Synonyms:
CHEMBL1987813
Type:
Small organic molecule
Emp. Form.:
C14H12O7
Mol. Mass.:
292.2409
SMILES:
O[C@H]1CC2=C([C@@H](O)[C@H]1O)C(=O)c1c(O)ccc(O)c1C2=O
: