Target
Receptor tyrosine-protein kinase erbB-2
Ligand
BDBM50174540
Substrate
Meas. Tech.
ChEMBL_1282411 (CHEMBL3100590)
IC50
11400±n/a nM
Citation
 Sridhar, JSfondouris, MEBratton, MRNguyen, TLTownley, IKlein Stevens, CLJones, FE Identification of quinones as HER2 inhibitors for the treatment of trastuzumab resistant breast cancer. Bioorg Med Chem Lett 24:126-31 (2014)  
Target
Name:
Receptor tyrosine-protein kinase erbB-2
Synonyms:
2.7.10.1 CD_antigen=CD340 ERBB2_HUMAN FASN/HER2 HER2 MLN19 NEU Proto-oncogene Neu Tyrosine kinase-type cell surface receptor HER2 | p185erbB2
Type:
Mol. Mass.:
137894.47
Organism:
Homo sapiens (Human)
Description:
P04626
Residue:
1255
  
Inhibitor
Name:
BDBM50174540
Synonyms:
CHEMBL1699836
Type:
Small organic molecule
Emp. Form.:
C12H10O6
Mol. Mass.:
250.2042
SMILES:
OCC1=C(CO)C(=O)c2c(O)ccc(O)c2C1=O
: