Target
Carbonic anhydrase 2
Ligand
BDBM10882
Substrate
Meas. Tech.
ChEMBL_1283437 (CHEMBL3107031)
Ki
8.0±n/a nM
Citation
 ?o?nowska, BS?awi?ski, JPogorzelska, AChojnacki, JVullo, DSupuran, CT Carbonic anhydrase inhibitors. Synthesis, and molecular structure of novel series N-substituted N'-(2-arylmethylthio-4-chloro-5-methylbenzenesulfonyl)guanidines and their inhibition of human cytosolic isozymes I and II and the transmembrane tumor-associated isozymes IX and XII. Eur J Med Chem 71:135-47 (2014)  
Target
Name:
Carbonic anhydrase 2
Synonyms:
CA-II CAC Carbonate dehydratase II Carbonic anhydrase 2 (CA-II) Carbonic anhydrase C Carbonic anhydrase II (CA-II) Carbonic anhydrase II (hCA II) | Carbonic anhydrase isoenzyme II (hCA II)
Type:
Enzyme
Mol. Mass.:
29250.71
Organism:
Homo sapiens (Human)
Description:
P00918
Residue:
260
  
Inhibitor
Name:
BDBM10882
Synonyms:
6-ethoxy-1,3-benzothiazole-2-sulfonamide Ethamide Ethoxzolamide Ethoxzolamide, EZM US10172837, Ethoxyzolamide | sulfonamide 3
Type:
Small organic molecule
Emp. Form.:
C9H10N2O3S2
Mol. Mass.:
258.317
SMILES:
CCOc1ccc2nc(sc2c1)S(N)(=O)=O
: