Target
Prostaglandin G/H synthase 2
Ligand
BDBM50495223
Substrate
Meas. Tech.
ChEMBL_1286093 (CHEMBL3106691)
IC50
170±n/a nM
Citation
 Irannejad, HKebriaieezadeh, AZarghi, AMontazer-Sadegh, FShafiee, AAssadieskandar, AAmini, M Synthesis, docking simulation, biological evaluations and 3D-QSAR study of 5-Aryl-6-(4-methylsulfonyl)-3-(metylthio)-1,2,4-triazine as selective cyclooxygenase-2 inhibitors. Bioorg Med Chem 22:865-73 (2014)  
Target
Name:
Prostaglandin G/H synthase 2
Synonyms:
COX2 Cyclooxygenase-2 (COX-2) PTGS2 Prostaglandin G/H synthase (cyclooxygenase)
Type:
Protein
Mol. Mass.:
68976.98
Organism:
Ovis aries (Sheep)
Description:
Residue:
603
  
Inhibitor
Name:
BDBM50495223
Synonyms:
CHEMBL3103779
Type:
Small organic molecule
Emp. Form.:
C18H17N3O3S2
Mol. Mass.:
387.476
SMILES:
COc1ccc(cc1)-c1nc(SC)nnc1-c1ccc(cc1)S(C)(=O)=O
: