Target
Fibroblast growth factor receptor 1
Ligand
BDBM50495331
Substrate
Meas. Tech.
ChEMBL_1286961 (CHEMBL3111126)
Kd
447±n/a nM
Citation
 Klein, TTucker, JHoldgate, GANorman, RABreeze, AL FGFR1 Kinase Inhibitors: Close Regioisomers Adopt Divergent Binding Modes and Display Distinct Biophysical Signatures. ACS Med Chem Lett 5:166-71 (2014)  
Target
Name:
Fibroblast growth factor receptor 1
Synonyms:
BFGFR Basic fibroblast growth factor receptor 1 (FGFR1) CEK FGFR-1 FGFR-1, (FL) FGFR1_HUMAN FLT2 Fibroblast growth factor receptor 1 (FGFR-1) Fms-like tyrosine kinase 2 N-sam bFGF-R | c-fgr
Type:
Receptor
Mol. Mass.:
91861.70
Organism:
Homo sapiens (Human)
Description:
P11362
Residue:
822
  
Inhibitor
Name:
BDBM50495331
Synonyms:
CHEMBL3109570
Type:
Small organic molecule
Emp. Form.:
C22H25N7O3
Mol. Mass.:
435.479
SMILES:
COc1ccc(CCc2cc(Nc3ccnc(NCc4cc(C)no4)n3)n[nH]2)cc1OC
: