Target
Interleukin-6 receptor subunit alpha
Ligand
BDBM85330
Substrate
Meas. Tech.
ChEMBL_220771 (CHEMBL842047)
Ki
>10000±n/a nM
Citation
 van Wijngaarden, IHamminga, Dvan Hes, RStandaar, PJTipker, JTulp, MTMol, FOlivier, Bde Jonge, A Development of high-affinity 5-HT3 receptor antagonists. Structure-affinity relationships of novel 1,7-annelated indole derivatives. J Med Chem 36:3693-9 (1994)  
Target
Name:
Interleukin-6 receptor subunit alpha
Synonyms:
IL6RA_RAT Il6ra | Interleukin-6 receptor alpha chain
Type:
PROTEIN
Mol. Mass.:
50182.76
Organism:
Rattus norvegicus
Description:
ChEMBL_218510
Residue:
460
  
Inhibitor
Name:
BDBM85330
Synonyms:
CAS_68647 ONDANSETRON | Ondansetron hydrochloride
Type:
Small organic molecule
Emp. Form.:
C18H19N3O
Mol. Mass.:
293.363
SMILES:
Cc1nccn1CC1CCc2c(C1=O)c1ccccc1n2C
: