Target
Mu-type opioid receptor
Ligand
BDBM50042769
Substrate
Meas. Tech.
ChEBML_221943
Ki
326±n/a nM
Citation
 Salvadori, SBryant, SDBianchi, CBalboni, GScaranari, VAttila, MLazarus, LH Phe3-substituted analogues of deltorphin C. Spatial conformation and topography of the aromatic ring in peptide recognition by delta opioid receptors. J Med Chem 36:3748-56 (1994)  
Target
Name:
Mu-type opioid receptor
Synonyms:
MOR-1 Mu-type opioid receptor (MOR) OPRM_RAT Opioid receptor B Ror-b
Type:
G Protein-Coupled Receptor (GPCR)
Mol. Mass.:
44503.11
Organism:
Rattus norvegicus (rat)
Description:
Competition binding assays were carried out using membrane preparations from transfected HN9.10 cells that constitutively expressed the mu opioid receptor.
Residue:
398
  
Inhibitor
Name:
BDBM50042769
Synonyms:
CHEMBL332416 | H-Tyr-D-Ala-Hfe-Asp-Val-Val-Gly-NH2
Type:
Small organic molecule
Emp. Form.:
C38H54N8O10
Mol. Mass.:
782.883
SMILES:
CC(C)[C@H](NC(=O)[C@@H](NC(=O)[C@H](CC(O)=O)NC(=O)[C@H](CCc1ccccc1)NC(=O)[C@@H](C)NC(=O)[C@@H](N)Cc1ccc(O)cc1)C(C)C)C(=O)NCC(N)=O
: