Target
Cannabinoid receptor 1
Ligand
BDBM50495630
Substrate
Meas. Tech.
ChEMBL_1291677 (CHEMBL3119424)
Ki
25±n/a nM
Citation
 Lucchesi, VParkkari, TSavinainen, JRMalfitano, AMAllarà, MBertini, SCastelli, FDel Carlo, SLaezza, CLigresti, ASaccomanni, GBifulco, MDi Marzo, VMacchia, MManera, C 1,2-Dihydro-2-oxopyridine-3-carboxamides: the C-5 substituent is responsible for functionality switch at CB2 cannabinoid receptor. Eur J Med Chem 74:524-32 (2014)  
Target
Name:
Cannabinoid receptor 1
Synonyms:
CANN6 CB-R CNR CNR1_HUMAN Cannabinoid receptor Cannabinoid receptor 1 (brain)
Type:
G Protein-Coupled Receptor (GPCR)
Mol. Mass.:
52868.96
Organism:
Homo sapiens (Human)
Description:
P21554
Residue:
472
  
Inhibitor
Name:
BDBM50495630
Synonyms:
CHEMBL3114344
Type:
Small organic molecule
Emp. Form.:
C25H29FN2O4
Mol. Mass.:
440.5072
SMILES:
CCOC(=O)\C=C\c1cc(C(=O)NC2CCCCCC2)c(=O)n(Cc2ccc(F)cc2)c1
: