Target
Cannabinoid receptor 1
Ligand
BDBM50495626
Substrate
Meas. Tech.
ChEMBL_1291677 (CHEMBL3119424)
Ki
35±n/a nM
Citation
 Lucchesi, VParkkari, TSavinainen, JRMalfitano, AMAllarà, MBertini, SCastelli, FDel Carlo, SLaezza, CLigresti, ASaccomanni, GBifulco, MDi Marzo, VMacchia, MManera, C 1,2-Dihydro-2-oxopyridine-3-carboxamides: the C-5 substituent is responsible for functionality switch at CB2 cannabinoid receptor. Eur J Med Chem 74:524-32 (2014)  
Target
Name:
Cannabinoid receptor 1
Synonyms:
CANN6 CB-R CNR CNR1_HUMAN Cannabinoid receptor Cannabinoid receptor 1 (brain)
Type:
G Protein-Coupled Receptor (GPCR)
Mol. Mass.:
52868.96
Organism:
Homo sapiens (Human)
Description:
P21554
Residue:
472
  
Inhibitor
Name:
BDBM50495626
Synonyms:
CHEMBL3114182
Type:
Small organic molecule
Emp. Form.:
C26H27FN2O2
Mol. Mass.:
418.5032
SMILES:
Fc1ccc(Cn2cc(cc(C(=O)NC3CCCCCC3)c2=O)-c2ccccc2)cc1
: