Target
Cannabinoid receptor 2
Ligand
BDBM50495646
Substrate
Meas. Tech.
ChEMBL_1291676 (CHEMBL3119423)
Ki
80±n/a nM
Citation
 Lucchesi, VParkkari, TSavinainen, JRMalfitano, AMAllarà, MBertini, SCastelli, FDel Carlo, SLaezza, CLigresti, ASaccomanni, GBifulco, MDi Marzo, VMacchia, MManera, C 1,2-Dihydro-2-oxopyridine-3-carboxamides: the C-5 substituent is responsible for functionality switch at CB2 cannabinoid receptor. Eur J Med Chem 74:524-32 (2014)  
Target
Name:
Cannabinoid receptor 2
Synonyms:
CANNABINOID CB2 CB2 CB2B CNR2_HUMAN Cannabinoid CB2 receptor Cannabinoid receptor 2 (CB2R) | hCB2
Type:
G Protein-Coupled Receptor (GPCR)
Mol. Mass.:
39690.94
Organism:
Homo sapiens (Human)
Description:
P34972
Residue:
360
  
Inhibitor
Name:
BDBM50495646
Synonyms:
CHEMBL3114346
Type:
Small organic molecule
Emp. Form.:
C20H23FN2O2
Mol. Mass.:
342.4072
SMILES:
CC1CCC(CC1)NC(=O)c1cccnc1OCc1ccc(F)cc1
: