Target
Cannabinoid receptor 1
Ligand
BDBM50495631
Substrate
Meas. Tech.
ChEMBL_1291677 (CHEMBL3119424)
Ki
24±n/a nM
Citation
 Lucchesi, VParkkari, TSavinainen, JRMalfitano, AMAllarà, MBertini, SCastelli, FDel Carlo, SLaezza, CLigresti, ASaccomanni, GBifulco, MDi Marzo, VMacchia, MManera, C 1,2-Dihydro-2-oxopyridine-3-carboxamides: the C-5 substituent is responsible for functionality switch at CB2 cannabinoid receptor. Eur J Med Chem 74:524-32 (2014)  
Target
Name:
Cannabinoid receptor 1
Synonyms:
CANN6 CB-R CNR CNR1_HUMAN Cannabinoid receptor Cannabinoid receptor 1 (brain)
Type:
G Protein-Coupled Receptor (GPCR)
Mol. Mass.:
52868.96
Organism:
Homo sapiens (Human)
Description:
P21554
Residue:
472
  
Inhibitor
Name:
BDBM50495631
Synonyms:
CHEMBL3114343
Type:
Small organic molecule
Emp. Form.:
C28H29FN2O2
Mol. Mass.:
444.5405
SMILES:
Fc1ccc(Cn2cc(\C=C\c3ccccc3)cc(C(=O)NC3CCCCCC3)c2=O)cc1
: