Target
Prostaglandin G/H synthase 1
Ligand
BDBM50153040
Substrate
Meas. Tech.
ChEMBL_1288416 (CHEMBL3118268)
IC50
500±n/a nM
Citation
 Vitale, PPerrone, MGMalerba, PLavecchia, AScilimati, A Selective COX-1 inhibition as a target of theranostic novel diarylisoxazoles. Eur J Med Chem 74:606-18 (2014)  
Target
Name:
Prostaglandin G/H synthase 1
Synonyms:
COX-1 Cyclooxygenase Cyclooxygenase-1 (COX-1) PTGS1 | Prostaglandin G/H synthase (cyclooxygenase)
Type:
Enzyme
Mol. Mass.:
68692.62
Organism:
Homo sapiens (Human)
Description:
P23219
Residue:
599
  
Inhibitor
Name:
BDBM50153040
Synonyms:
3-(5-Chloro-furan-2-yl)-5-methyl-4-phenyl-isoxazole | CHEMBL363228
Type:
Small organic molecule
Emp. Form.:
C14H10ClNO2
Mol. Mass.:
259.688
SMILES:
Cc1onc(-c2ccc(Cl)o2)c1-c1ccccc1
: