Target
Transmembrane prolyl 4-hydroxylase
Ligand
BDBM50042873
Substrate
Meas. Tech.
ChEBML_223465
IC50
320±n/a nM
Citation
 Hales, NJBeattie, JF Novel inhibitors of prolyl 4-hydroxylase. 5. The intriguing structure-activity relationships seen with 2,2'-bipyridine and its 5,5'-dicarboxylic acid derivatives. J Med Chem 36:3853-8 (1994)  
Target
Name:
Transmembrane prolyl 4-hydroxylase
Synonyms:
Hypoxia-inducible factor prolyl 4-hydroxylase Hypoxia-inducible factor prolyl hydroxylase 4 P4HTM PH4 | Transmembrane prolyl 4-hydroxylase
Type:
Enzyme
Mol. Mass.:
56654.25
Organism:
Homo sapiens (Human)
Description:
Q9NXG6
Residue:
502
  
Inhibitor
Name:
BDBM50042873
Synonyms:
5'-(4-Ethoxy-phenylcarbamoyl)-[2,2']bipyridinyl-5-carboxylic acid | CHEMBL124527
Type:
Small organic molecule
Emp. Form.:
C20H17N3O4
Mol. Mass.:
363.3667
SMILES:
CCOc1ccc(NC(=O)c2ccc(nc2)-c2ccc(cn2)C(O)=O)cc1
: