Target
Transmembrane prolyl 4-hydroxylase
Ligand
BDBM50042874
Substrate
Meas. Tech.
ChEBML_223465
IC50
34200±n/a nM
Citation
 Hales, NJBeattie, JF Novel inhibitors of prolyl 4-hydroxylase. 5. The intriguing structure-activity relationships seen with 2,2'-bipyridine and its 5,5'-dicarboxylic acid derivatives. J Med Chem 36:3853-8 (1994)  
Target
Name:
Transmembrane prolyl 4-hydroxylase
Synonyms:
Hypoxia-inducible factor prolyl 4-hydroxylase Hypoxia-inducible factor prolyl hydroxylase 4 P4HTM PH4 | Transmembrane prolyl 4-hydroxylase
Type:
Enzyme
Mol. Mass.:
56654.25
Organism:
Homo sapiens (Human)
Description:
Q9NXG6
Residue:
502
  
Inhibitor
Name:
BDBM50042874
Synonyms:
2,2'-Bipyridin 2,2'-bipyridyl 2,2'-dipyridyl CHEMBL39879 alpha,alpha'-bipyridine alpha,alpha'-dipyridine bpy
Type:
Small organic molecule
Emp. Form.:
C10H8N2
Mol. Mass.:
156.1839
SMILES:
c1ccc(nc1)-c1ccccn1
: