Target
Polyunsaturated fatty acid 5-lipoxygenase
Ligand
BDBM50004679
Substrate
Meas. Tech.
ChEBML_3921
IC50
6.9±n/a nM
Citation
 Sogawa, SNihro, YUeda, HIzumi, AMiki, TMatsumoto, HSatoh, T 3,4-Dihydroxychalcones as potent 5-lipoxygenase and cyclooxygenase inhibitors. J Med Chem 36:3904-9 (1994)  
Target
Name:
Polyunsaturated fatty acid 5-lipoxygenase
Synonyms:
Alox5 LOX5_RAT
Type:
PROTEIN
Mol. Mass.:
78082.31
Organism:
Rattus norvegicus
Description:
ChEMBL_1432947
Residue:
673
  
Inhibitor
Name:
BDBM50004679
Synonyms:
2-Benzyl-naphthalen-1-ol CHEMBL85000
Type:
Small organic molecule
Emp. Form.:
C17H14O
Mol. Mass.:
234.2925
SMILES:
Oc1c(Cc2ccccc2)ccc2ccccc12
: