Target
Polyunsaturated fatty acid 5-lipoxygenase
Ligand
BDBM50042990
Substrate
Meas. Tech.
ChEBML_3921
IC50
16±n/a nM
Citation
 Sogawa, SNihro, YUeda, HIzumi, AMiki, TMatsumoto, HSatoh, T 3,4-Dihydroxychalcones as potent 5-lipoxygenase and cyclooxygenase inhibitors. J Med Chem 36:3904-9 (1994)  
Target
Name:
Polyunsaturated fatty acid 5-lipoxygenase
Synonyms:
Alox5 LOX5_RAT
Type:
PROTEIN
Mol. Mass.:
78082.31
Organism:
Rattus norvegicus
Description:
ChEMBL_1432947
Residue:
673
  
Inhibitor
Name:
BDBM50042990
Synonyms:
(E)-3-(3'',4''-Dihydroxyphenyl)-1-(3',4',5'-trimethoxyphenyl)prop-2-en-1-one 3,4-dihydroxy-3',4',5'-trimethoxychalcone 3-(3,4-dihydroxyphenyl)-1-(3,4,5-trimethoxyphenyl)prop-2-en-1-one | CHEMBL126617
Type:
Small organic molecule
Emp. Form.:
C18H18O6
Mol. Mass.:
330.3319
SMILES:
COc1cc(cc(OC)c1OC)C(=O)\C=C\c1ccc(O)c(O)c1
: