Target
Genome polyprotein
Ligand
BDBM50485492
Substrate
Meas. Tech.
ChEMBL_1291857 (CHEMBL3124057)
IC50
5.3±n/a nM
Citation
 Shah, UJayne, CChackalamannil, SVelázquez, FGuo, ZBuevich, AHowe, JAChase, RSoriano, AAgrawal, SRudd, MTMcCauley, JALiverton, NJRomano, JBush, KColeman, PJGrisé-Bard, CBrochu, MCCharron, SAulakh, VBachand, BBeaulieu, PZaghdane, HBhat, SHan, YVacca, JPDavies, IWWeber, AEVenkatraman, S Novel Quinoline-Based P2-P4 Macrocyclic Derivatives As Pan-Genotypic HCV NS3/4a Protease Inhibitors. ACS Med Chem Lett 5:264-9 (2014)  
Target
Name:
Genome polyprotein
Synonyms:
NS3 Protease
Type:
Protein
Mol. Mass.:
18999.15
Organism:
Hepatitis C Virus
Description:
ABC73367
Residue:
181
  
Inhibitor
Name:
BDBM50485492
Synonyms:
Grazoprevir MK-5172 MK-5172 MONOHYDRATE
Type:
Small organic molecule
Emp. Form.:
C38H50N6O9S
Mol. Mass.:
766.903
SMILES:
[H][C@@]12C[C@@]1([H])OC(=O)N[C@H](C(=O)N1C[C@@]([H])(C[C@H]1C(=O)N[C@@]1(C[C@H]1C=C)C(=O)NS(=O)(=O)C1CC1)Oc1nc3cc(OC)ccc3nc1CCCCC2)C(C)(C)C
: