Target
Stromelysin-1
Ligand
BDBM50043802
Substrate
Meas. Tech.
ChEMBL_205499 (CHEMBL810391)
IC50
>500000±n/a nM
Citation
 Ye, QZJohnson, LLNordan, IHupe, DHupe, L A recombinant human stromelysin catalytic domain identifying tryptophan derivatives as human stromelysin inhibitors. J Med Chem 37:206-9 (1994)  
Target
Name:
Stromelysin-1
Synonyms:
MMP-3 MMP3_HUMAN Matrix metalloproteinase 3 Matrix metalloproteinase-3 (MMP-3) SL-1 Stromelysin 1 | Transin-1
Type:
Enzyme
Mol. Mass.:
53973.13
Organism:
Homo sapiens (Human)
Description:
P08254
Residue:
477
  
Inhibitor
Name:
BDBM50043802
Synonyms:
(S)-2-Acetylamino-3-(4-hydroxy-phenyl)-propionic acid N-acetyl-L-tyrosine
Type:
Small organic molecule
Emp. Form.:
C11H13NO4
Mol. Mass.:
223.2252
SMILES:
CC(=O)N[C@@H](Cc1ccc(O)cc1)C(O)=O
: