Target
Thromboxane A2 receptor
Ligand
BDBM50043843
Substrate
Meas. Tech.
ChEMBL_209590 (CHEMBL814725)
IC50
33±n/a nM
Citation
 Soyka, RHeckel, ANickl, JEisert, WMüller, THWeisenberger, H 6,6-Disubstituted Hex-5-enoic acid derivatives as combined thromboxane A2 receptor antagonists and synthetase inhibitors. J Med Chem 37:26-39 (1994)  
Target
Name:
Thromboxane A2 receptor
Synonyms:
Prostanoid TP receptor TBXA2R Thromboxane Thromboxane Beta
Type:
Enyzme
Mol. Mass.:
37445.28
Organism:
Homo sapiens (Human)
Description:
P21731
Residue:
343
  
Inhibitor
Name:
BDBM50043843
Synonyms:
(E)-6-Pyridin-3-yl-6-{4-[2-(toluene-4-sulfonylamino)-ethyl]-phenyl}-hex-5-enoic acid | CHEMBL129734
Type:
Small organic molecule
Emp. Form.:
C26H28N2O4S
Mol. Mass.:
464.577
SMILES:
Cc1ccc(cc1)S(=O)(=O)NCCc1ccc(cc1)C(=C/CCCC(O)=O)\c1cccnc1
: