Target
Signal transducer and activator of transcription 3
Ligand
BDBM50353441
Substrate
Meas. Tech.
ChEMBL_1301030 (CHEMBL3137022)
IC50
35000±n/a nM
Citation
 Urlam, MKPireddu, RGe, YZhang, XSun, YLawrence, HRGuida, WCSebti, SMLawrence, NJ Development of new  Medchemcomm 4:932-941 (2013)  
Target
Name:
Signal transducer and activator of transcription 3
Synonyms:
APRF STAT3_HUMAN Signal transducer and activator of transcription 3 (STAT3)
Type:
Protein
Mol. Mass.:
88064.31
Organism:
Homo sapiens (Human)
Description:
P40763
Residue:
770
  
Inhibitor
Name:
BDBM50353441
Synonyms:
CHEMBL1829786
Type:
Small organic molecule
Emp. Form.:
C30H34N2O6S
Mol. Mass.:
550.666
SMILES:
CN(CC(=O)N(Cc1ccc(cc1)C1CCCCC1)c1ccc(C(O)=O)c(O)c1)S(=O)(=O)c1ccc(C)cc1
: