Target
Somatostatin receptor type 4
Ligand
BDBM50496734
Substrate
Meas. Tech.
ChEMBL_1330642 (CHEMBL3222547)
Ki
690±n/a nM
Citation
 Marugan, JJHuang, WMotabar, OZheng, WXiao, JPatnaik, SSouthall, NWestbroek, WLea, WASimeonov, AGoldin, EDebernardi, MASidransky, E Non-iminosugar glucocerebrosidase small molecule chaperones. Medchemcomm 3:56-60 (2012)  
Target
Name:
Somatostatin receptor type 4
Synonyms:
SOMATOSTATIN SST4 SS4-R SSR4_HUMAN SSTR4 | Somatostatin receptor type 4 (SSTR4)
Type:
Enzyme
Mol. Mass.:
42015.38
Organism:
Homo sapiens (Human)
Description:
P31391
Residue:
388
  
Inhibitor
Name:
BDBM50496734
Synonyms:
CHEMBL1590268
Type:
Small organic molecule
Emp. Form.:
C15H21BrN6S
Mol. Mass.:
397.336
SMILES:
Brc1ccc(NCCCNC(=S)NCCCc2c[nH]cn2)nc1
: