Target
cGMP-inhibited 3',5'-cyclic phosphodiesterase 3A
Ligand
BDBM50496803
Substrate
Meas. Tech.
ChEMBL_1328994 (CHEMBL3223415)
IC50
27500±n/a nM
Citation
 Li, JJin, HZhou, HRothfuss, JTu, Z Synthesis and  Medchemcomm 4:443-449 (2013)  
Target
Name:
cGMP-inhibited 3',5'-cyclic phosphodiesterase 3A
Synonyms:
3',5'-cyclic phosphodiesterase Cyclic GMP-inhibited phosphodiesterase A PDE3A_HUMAN Phosphodiesterase 3 (PDE3) Phosphodiesterase 3A Phosphodiesterase 3A (PDE3A1) cGMP-inhibited 3',5'-cyclic phosphodiesterase A | cGMP-inhibited 3,5-cyclic phosphodiesterase A
Type:
Enzyme
Mol. Mass.:
124966.46
Organism:
Homo sapiens (Human)
Description:
Q14432
Residue:
1141
  
Inhibitor
Name:
BDBM50496803
Synonyms:
CHEMBL3218037
Type:
Small organic molecule
Emp. Form.:
C26H22N4O2
Mol. Mass.:
422.4785
SMILES:
COc1cc(COc2ccc(cc2)-c2nn(C)cc2-c2ccncc2)nc2ccccc12
: