Target
cAMP and cAMP-inhibited cGMP 3',5'-cyclic phosphodiesterase 10A
Ligand
BDBM50496826
Substrate
Meas. Tech.
ChEMBL_1328995 (CHEMBL3223416)
IC50
400±n/a nM
Citation
 Li, JJin, HZhou, HRothfuss, JTu, Z Synthesis and  Medchemcomm 4:443-449 (2013)  
Target
Name:
cAMP and cAMP-inhibited cGMP 3',5'-cyclic phosphodiesterase 10A
Synonyms:
3',5'-cyclic phosphodiesterase PDE10A Phosphodiesterase 10 (PDE10) | Phosphodiesterase 10A
Type:
Protein
Mol. Mass.:
88412.52
Organism:
Homo sapiens (Human)
Description:
Q9Y233
Residue:
1055
  
Inhibitor
Name:
BDBM50496826
Synonyms:
CHEMBL3218044
Type:
Small organic molecule
Emp. Form.:
C26H22N4OS
Mol. Mass.:
438.544
SMILES:
COc1ccc2ccc(CSc3ccc(cc3)-c3nn(C)cc3-c3ccncc3)nc2c1
: