Target
cAMP and cAMP-inhibited cGMP 3',5'-cyclic phosphodiesterase 10A
Ligand
BDBM50496811
Substrate
Meas. Tech.
ChEMBL_1328995 (CHEMBL3223416)
IC50
0.360000±n/a nM
Citation
 Li, JJin, HZhou, HRothfuss, JTu, Z Synthesis and  Medchemcomm 4:443-449 (2013)  
Target
Name:
cAMP and cAMP-inhibited cGMP 3',5'-cyclic phosphodiesterase 10A
Synonyms:
3',5'-cyclic phosphodiesterase PDE10A Phosphodiesterase 10 (PDE10) | Phosphodiesterase 10A
Type:
Protein
Mol. Mass.:
88412.52
Organism:
Homo sapiens (Human)
Description:
Q9Y233
Residue:
1055
  
Inhibitor
Name:
BDBM50496811
Synonyms:
CHEMBL3222274
Type:
Small organic molecule
Emp. Form.:
C26H22N4O2
Mol. Mass.:
422.4785
SMILES:
COc1cc(COc2ccc(cc2)-c2c(cnn2C)-c2ccncc2)nc2ccccc12
: