Target
B2 bradykinin receptor
Ligand
BDBM50406749
Substrate
Meas. Tech.
ChEBML_40277
Ki
0.750000±n/a nM
Citation
 Kyle, DJBlake, PRSmithwick, DGreen, LMMartin, JASinsko, JASummers, MF NMR and computational evidence that high-affinity bradykinin receptor antagonists adopt C-terminal beta-turns. J Med Chem 36:1450-60 (1993)  
Target
Name:
B2 bradykinin receptor
Synonyms:
B2 bradykinin receptor BDKRB2 BKRB2_CAVPO | Bradykinin B2 receptor
Type:
Mol. Mass.:
42217.03
Organism:
Cavia porcellus
Description:
Residue:
372
  
Inhibitor
Name:
BDBM50406749
Synonyms:
CHEMBL2028979
Type:
Small organic molecule
Emp. Form.:
C60H91N19O12
Mol. Mass.:
1270.4846
SMILES:
N[C@H](CCCNC(N)=N)C(=O)N[C@@H](CCCNC(N)=N)C(=O)N1CCC[C@H]1C(=O)N1CCC[C@H]1C(=O)NCC(=O)N[C@@H](Cc1ccccc1)C(=O)N[C@@H](CO)C(=O)N[C@H](Cc1ccccc1)C(=O)N1[C@@H](CC2CCCCC12)C(=O)N[C@@H](CCCNC(N)=N)C(O)=O
: