Target
B2 bradykinin receptor
Ligand
BDBM50036833
Substrate
Meas. Tech.
ChEBML_40275
Ki
0.080000±n/a nM
Citation
 Chakravarty, SWilkins, DKyle, DJ Design of potent, cyclic peptide bradykinin receptor antagonists from conformationally constrained linear peptides. J Med Chem 36:2569-71 (1993)  
Target
Name:
B2 bradykinin receptor
Synonyms:
B2 bradykinin receptor BDKRB2 BKRB2_CAVPO | Bradykinin B2 receptor
Type:
Mol. Mass.:
42217.03
Organism:
Cavia porcellus
Description:
Residue:
372
  
Inhibitor
Name:
BDBM50036833
Synonyms:
CHEMBL2371961 | D-Arg-Arg-Pro-Hyp-Gly-Phe-Ser-D-Tic-Oic-Arg
Type:
Small organic molecule
Emp. Form.:
C61H91N19O13
Mol. Mass.:
1298.4947
SMILES:
[#7]-[#6@H](-[#6]-[#6]-[#6]\[#7]=[#6](\[#7])-[#7])-[#6](=O)-[#7]-[#6@@H](-[#6]-[#6]-[#6]\[#7]=[#6](\[#7])-[#7])-[#6](=O)-[#7]-1-[#6]-[#6]-[#6]-[#6@H]-1-[#6](=O)-[#7]-1-[#6]-[#6@H](-[#8])-[#6]-[#6@H]-1-[#6](=O)-[#7]-[#6]-[#6](=O)-[#7]-[#6@@H](-[#6]-c1ccccc1)-[#6](=O)-[#7]-[#6@@H](-[#6]-[#8])-[#6](=O)-[#7]-1-[#6]-[#6]-c2ccccc2-[#6@@H]-1-[#6](=O)-[#7]-1-[#6]-[#6@H](-[#6]-2-[#6]-[#6]-[#6]-[#6]-[#6]-1-2)-[#6](=O)-[#7]-[#6@@H](-[#6]-[#6]-[#6]\[#7]=[#6](\[#7])-[#7])-[#6](-[#8])=O
: