Target
WD repeat-containing protein 48
Ligand
BDBM50497317
Substrate
Meas. Tech.
ChEMBL_1442190 (CHEMBL3375263)
IC50
1600±n/a nM
Citation
 Dexheimer, TSRosenthal, ASLuci, DKLiang, QVillamil, MAChen, JSun, HKerns, EHSimeonov, AJadhav, AZhuang, ZMaloney, DJ Synthesis and structure-activity relationship studies of N-benzyl-2-phenylpyrimidin-4-amine derivatives as potent USP1/UAF1 deubiquitinase inhibitors with anticancer activity against nonsmall cell lung cancer. J Med Chem 57:8099-110 (2014)  
Target
Name:
WD repeat-containing protein 48
Synonyms:
KIAA1449 USP1-associated factor 1 WD repeat endosomal protein WDR48 p80
Type:
PROTEIN
Mol. Mass.:
76215.66
Organism:
Homo sapiens (Human)
Description:
ChEMBL_109642
Residue:
677
  
Inhibitor
Name:
BDBM50497317
Synonyms:
CHEMBL3188953
Type:
Small organic molecule
Emp. Form.:
C26H19BrN4
Mol. Mass.:
467.36
SMILES:
Brc1ccccc1-c1nc(NCc2ccc(cc2)-c2cccnc2)c2ccccc2n1
: