Target
WD repeat-containing protein 48
Ligand
BDBM351941
Substrate
Meas. Tech.
ChEMBL_1442190 (CHEMBL3375263)
IC50
130±n/a nM
Citation
 Dexheimer, TSRosenthal, ASLuci, DKLiang, QVillamil, MAChen, JSun, HKerns, EHSimeonov, AJadhav, AZhuang, ZMaloney, DJ Synthesis and structure-activity relationship studies of N-benzyl-2-phenylpyrimidin-4-amine derivatives as potent USP1/UAF1 deubiquitinase inhibitors with anticancer activity against nonsmall cell lung cancer. J Med Chem 57:8099-110 (2014)  
Target
Name:
WD repeat-containing protein 48
Synonyms:
KIAA1449 USP1-associated factor 1 WD repeat endosomal protein WDR48 p80
Type:
PROTEIN
Mol. Mass.:
76215.66
Organism:
Homo sapiens (Human)
Description:
ChEMBL_109642
Residue:
677
  
Inhibitor
Name:
BDBM351941
Synonyms:
US9802904, 67
Type:
Small organic molecule
Emp. Form.:
C22H25N3
Mol. Mass.:
331.454
SMILES:
CC(C)c1ccccc1-c1ncc(C)c(NCc2cccc(C)c2)n1
: