Target
WD repeat-containing protein 48
Ligand
BDBM351968
Substrate
Meas. Tech.
ChEMBL_1442190 (CHEMBL3375263)
IC50
270±n/a nM
Citation
 Dexheimer, TSRosenthal, ASLuci, DKLiang, QVillamil, MAChen, JSun, HKerns, EHSimeonov, AJadhav, AZhuang, ZMaloney, DJ Synthesis and structure-activity relationship studies of N-benzyl-2-phenylpyrimidin-4-amine derivatives as potent USP1/UAF1 deubiquitinase inhibitors with anticancer activity against nonsmall cell lung cancer. J Med Chem 57:8099-110 (2014)  
Target
Name:
WD repeat-containing protein 48
Synonyms:
KIAA1449 USP1-associated factor 1 WD repeat endosomal protein WDR48 p80
Type:
PROTEIN
Mol. Mass.:
76215.66
Organism:
Homo sapiens (Human)
Description:
ChEMBL_109642
Residue:
677
  
Inhibitor
Name:
BDBM351968
Synonyms:
US9802904, 69
Type:
Small organic molecule
Emp. Form.:
C19H21N3S
Mol. Mass.:
323.455
SMILES:
CC(C)c1ccccc1-c1ncc(C)c(NCc2cccs2)n1
: