Target
Retinoic acid receptor gamma
Ligand
BDBM50045279
Substrate
Meas. Tech.
ChEBML_163495
EC50
1300±n/a nM
Citation
 Jong, LLehmann, JMHobbs, PDHarlev, EHuffman, JCPfahl, MDawson, MI Conformational effects on retinoid receptor selectivity. 1. Effect of 9-double bond geometry on retinoid X receptor activity. J Med Chem 36:2605-13 (1993)  
Target
Name:
Retinoic acid receptor gamma
Synonyms:
NR1B3 RAR-gamma RARG_HUMAN Retinoic acid receptor gamma | Retinoid receptor
Type:
PROTEIN
Mol. Mass.:
50345.43
Organism:
Homo sapiens (Human)
Description:
ChEMBL_1458016
Residue:
454
  
Inhibitor
Name:
BDBM50045279
Synonyms:
4-[2-Methyl-4-(2,6,6-trimethyl-cyclohex-1-enyl)-but-1-enyl]-benzoic acid | CHEMBL313742
Type:
Small organic molecule
Emp. Form.:
C21H28O2
Mol. Mass.:
312.4458
SMILES:
C\C(CCC1=C(C)CCCC1(C)C)=C\c1ccc(cc1)C(O)=O
: