Target
Adenosine receptor A1
Ligand
BDBM50045343
Substrate
Meas. Tech.
ChEBML_29016
Ki
12000±n/a nM
Citation
 Jacobson, KAShi, DGallo-Rodriguez, CManning, MMüller, CDaly, JWNeumeyer, JLKiriasis, LPfleiderer, W Effect of trifluoromethyl and other substituents on activity of xanthines at adenosine receptors. J Med Chem 36:2639-44 (1993)  
Target
Name:
Adenosine receptor A1
Synonyms:
AA1R_RAT ADENOSINE A1 high Adenosine A1 receptor (A1) Adenosine receptors A1 | Adora1
Type:
Protein
Mol. Mass.:
36704.13
Organism:
Rattus norvegicus (rat)
Description:
Residue:
326
  
Inhibitor
Name:
BDBM50045343
Synonyms:
3-(1,3,7-Trimethyl-2,6-dioxo-2,3,6,7-tetrahydro-1H-purin-8-yl)-acrylic acid tert-butyl ester | CHEMBL424433
Type:
Small organic molecule
Emp. Form.:
C15H20N4O4
Mol. Mass.:
320.3437
SMILES:
Cn1c(\C=C\C(=O)OC(C)(C)C)nc2n(C)c(=O)n(C)c(=O)c12
: