Target
Adenosine receptor A1
Ligand
BDBM50045345
Substrate
Meas. Tech.
ChEBML_29016
Ki
10200±n/a nM
Citation
 Jacobson, KAShi, DGallo-Rodriguez, CManning, MMüller, CDaly, JWNeumeyer, JLKiriasis, LPfleiderer, W Effect of trifluoromethyl and other substituents on activity of xanthines at adenosine receptors. J Med Chem 36:2639-44 (1993)  
Target
Name:
Adenosine receptor A1
Synonyms:
AA1R_RAT ADENOSINE A1 high Adenosine A1 receptor (A1) Adenosine receptors A1 | Adora1
Type:
Protein
Mol. Mass.:
36704.13
Organism:
Rattus norvegicus (rat)
Description:
Residue:
326
  
Inhibitor
Name:
BDBM50045345
Synonyms:
8-Bromo-1,3-dimethyl-3,7-dihydro-purine-2,6-dione | CHEMBL316160
Type:
Small organic molecule
Emp. Form.:
C7H7BrN4O2
Mol. Mass.:
259.06
SMILES:
Cn1c2nc(Br)[nH]c2c(=O)n(C)c1=O
: