Target
Adenosine receptor A1
Ligand
BDBM50045347
Substrate
Meas. Tech.
ChEBML_29016
Ki
150±n/a nM
Citation
 Jacobson, KAShi, DGallo-Rodriguez, CManning, MMüller, CDaly, JWNeumeyer, JLKiriasis, LPfleiderer, W Effect of trifluoromethyl and other substituents on activity of xanthines at adenosine receptors. J Med Chem 36:2639-44 (1993)  
Target
Name:
Adenosine receptor A1
Synonyms:
AA1R_RAT ADENOSINE A1 high Adenosine A1 receptor (A1) Adenosine receptors A1 | Adora1
Type:
Protein
Mol. Mass.:
36704.13
Organism:
Rattus norvegicus (rat)
Description:
Residue:
326
  
Inhibitor
Name:
BDBM50045347
Synonyms:
1,3-Dimethyl-8-(4-trifluoromethyl-phenyl)-3,7-dihydro-purine-2,6-dione | CHEMBL89383
Type:
Small organic molecule
Emp. Form.:
C14H11F3N4O2
Mol. Mass.:
324.2579
SMILES:
Cn1c2nc([nH]c2c(=O)n(C)c1=O)-c1ccc(cc1)C(F)(F)F
: