Target
Adenosine receptor A1
Ligand
BDBM50045339
Substrate
Meas. Tech.
ChEBML_29016
Ki
2900±n/a nM
Citation
 Jacobson, KAShi, DGallo-Rodriguez, CManning, MMüller, CDaly, JWNeumeyer, JLKiriasis, LPfleiderer, W Effect of trifluoromethyl and other substituents on activity of xanthines at adenosine receptors. J Med Chem 36:2639-44 (1993)  
Target
Name:
Adenosine receptor A1
Synonyms:
AA1R_RAT ADENOSINE A1 high Adenosine A1 receptor (A1) Adenosine receptors A1 | Adora1
Type:
Protein
Mol. Mass.:
36704.13
Organism:
Rattus norvegicus (rat)
Description:
Residue:
326
  
Inhibitor
Name:
BDBM50045339
Synonyms:
7-Allyl-1,3-dipropyl-8-(4-trifluoromethyl-phenyl)-3,7-dihydro-purine-2,6-dione | CHEMBL313543
Type:
Small organic molecule
Emp. Form.:
C21H23F3N4O2
Mol. Mass.:
420.4281
SMILES:
CCCn1c2nc(-c3ccc(cc3)C(F)(F)F)n(CC=C)c2c(=O)n(CCC)c1=O
: