Target
Adenosine receptor A2a
Ligand
BDBM50018162
Substrate
Meas. Tech.
ChEBML_29991
Ki
790.0±n/a nM
Citation
 Jacobson, KAShi, DGallo-Rodriguez, CManning, MMüller, CDaly, JWNeumeyer, JLKiriasis, LPfleiderer, W Effect of trifluoromethyl and other substituents on activity of xanthines at adenosine receptors. J Med Chem 36:2639-44 (1993)  
Target
Name:
Adenosine receptor A2a
Synonyms:
AA2AR_RAT Adenosine A2 receptor Adenosine Receptors A2a (A2a) Adenosine receptors A2a Rat striatal adenosine A2a receptor
Type:
G Protein-Coupled Receptor (GPCR)
Mol. Mass.:
45015.65
Organism:
Rattus norvegicus (rat)
Description:
Rat A2A receptors expressed in CHO cells.
Residue:
410
  
Inhibitor
Name:
BDBM50018162
Synonyms:
4-(2,6-Dioxo-1,3-dipropyl-2,3,6,7-tetrahydro-1H-purin-8-yl)-benzenesulfonic acid 4-(2,6-dioxo-1,3-dipropyl-2,3,6,7-tetrahydro-1H-purin-8-yl)benzenesulfonic acid | CHEMBL418333
Type:
Small organic molecule
Emp. Form.:
C17H20N4O5S
Mol. Mass.:
392.429
SMILES:
CCCn1c2nc([nH]c2c(=O)n(CCC)c1=O)-c1ccc(cc1)S(O)(=O)=O
: