Target
Arachidonate 5-lipoxygenase-activating protein
Ligand
BDBM50045664
Substrate
Meas. Tech.
ChEBML_4310
IC50
390±n/a nM
Citation
 Hutchinson, JHRiendeau, DBrideau, CChan, CDelorme, DDenis, DFalgueyret, JPFortin, RGuay, JHamel, P Substituted thiopyrano[2,3,4-c,d]indoles as potent, selective, and orally active inhibitors of 5-lipoxygenase. Synthesis and biological evaluation of L-691,816. J Med Chem 36:2771-87 (1993)  
Target
Name:
Arachidonate 5-lipoxygenase-activating protein
Synonyms:
5-lipoxygenase activating protein 5-lipoxygenase/FLAP ALOX5AP MK-886-binding protein
Type:
Enzyme
Mol. Mass.:
18159.90
Organism:
Homo sapiens (Human)
Description:
P20292
Residue:
161
  
Inhibitor
Name:
BDBM50045664
Synonyms:
3-[1-(4-Chloro-benzyl)-6-(isoquinolin-3-ylmethoxy)-4-methyl-4,5-dihydro-1H-3-thia-1-aza-acenaphthylen-2-yl]-2,2-dimethyl-propionic acid | CHEMBL430487
Type:
Small organic molecule
Emp. Form.:
C33H31ClN2O3S
Mol. Mass.:
571.129
SMILES:
CC1Cc2c(OCc3cc4ccccc4cn3)ccc3n(Cc4ccc(Cl)cc4)c(CC(C)(C)C(O)=O)c(S1)c23
: