Target
Polyunsaturated fatty acid 5-lipoxygenase
Ligand
BDBM50045672
Substrate
Meas. Tech.
ChEBML_4181
IC50
500±n/a nM
Citation
 Hutchinson, JHRiendeau, DBrideau, CChan, CDelorme, DDenis, DFalgueyret, JPFortin, RGuay, JHamel, P Substituted thiopyrano[2,3,4-c,d]indoles as potent, selective, and orally active inhibitors of 5-lipoxygenase. Synthesis and biological evaluation of L-691,816. J Med Chem 36:2771-87 (1993)  
Target
Name:
Polyunsaturated fatty acid 5-lipoxygenase
Synonyms:
Alox5 LOX5_RAT
Type:
PROTEIN
Mol. Mass.:
78082.31
Organism:
Rattus norvegicus
Description:
ChEMBL_1432947
Residue:
673
  
Inhibitor
Name:
BDBM50045672
Synonyms:
3-[6-(5-Butyl-pyridin-2-ylmethoxy)-1-(4-chloro-benzyl)-4-methyl-4,5-dihydro-1H-3-thia-1-aza-acenaphthylen-2-yl]-2,2-dimethyl-propionic acid | CHEMBL329529
Type:
Small organic molecule
Emp. Form.:
C33H37ClN2O3S
Mol. Mass.:
577.176
SMILES:
CCCCc1ccc(COc2ccc3n(Cc4ccc(Cl)cc4)c(CC(C)(C)C(O)=O)c4SC(C)Cc2c34)nc1
: