Target
Mu-type opioid receptor
Ligand
BDBM50045781
Substrate
Meas. Tech.
ChEBML_220391
Ki
0.340000±n/a nM
Citation
 Mitch, CHLeander, JDMendelsohn, LGShaw, WNWong, DTCantrell, BEJohnson, BGReel, JKSnoddy, JDTakemori, AE 3,4-Dimethyl-4-(3-hydroxyphenyl)piperidines: opioid antagonists with potent anorectant activity. J Med Chem 36:2842-50 (1993)  
Target
Name:
Mu-type opioid receptor
Synonyms:
MOR-1 Mu-type opioid receptor (MOR) OPRM_RAT Opioid receptor B Ror-b
Type:
G Protein-Coupled Receptor (GPCR)
Mol. Mass.:
44503.11
Organism:
Rattus norvegicus (rat)
Description:
Competition binding assays were carried out using membrane preparations from transfected HN9.10 cells that constitutively expressed the mu opioid receptor.
Residue:
398
  
Inhibitor
Name:
BDBM50045781
Synonyms:
1-Cyclohexyl-3-[4-(3-hydroxy-phenyl)-3,4-dimethyl-piperidin-1-yl]-propan-1-one | CHEMBL96776
Type:
Small organic molecule
Emp. Form.:
C22H33NO2
Mol. Mass.:
343.5029
SMILES:
C[C@H]1CN(CCC(=O)C2CCCCC2)CC[C@@]1(C)c1cccc(O)c1
: