Target
Mu-type opioid receptor
Ligand
BDBM50045786
Substrate
Meas. Tech.
ChEBML_220391
Ki
0.410000±n/a nM
Citation
 Mitch, CHLeander, JDMendelsohn, LGShaw, WNWong, DTCantrell, BEJohnson, BGReel, JKSnoddy, JDTakemori, AE 3,4-Dimethyl-4-(3-hydroxyphenyl)piperidines: opioid antagonists with potent anorectant activity. J Med Chem 36:2842-50 (1993)  
Target
Name:
Mu-type opioid receptor
Synonyms:
MOR-1 Mu-type opioid receptor (MOR) OPRM_RAT Opioid receptor B Ror-b
Type:
G Protein-Coupled Receptor (GPCR)
Mol. Mass.:
44503.11
Organism:
Rattus norvegicus (rat)
Description:
Competition binding assays were carried out using membrane preparations from transfected HN9.10 cells that constitutively expressed the mu opioid receptor.
Residue:
398
  
Inhibitor
Name:
BDBM50045786
Synonyms:
3-[1-(3-Cyclopentyl-3-hydroxy-propyl)-3,4-dimethyl-piperidin-4-yl]-phenol | CHEMBL317756
Type:
Small organic molecule
Emp. Form.:
C21H33NO2
Mol. Mass.:
331.4922
SMILES:
C[C@H]1CN(CCC(O)C2CCCC2)CC[C@@]1(C)c1cccc(O)c1
: