Target
Integrin alpha-V/beta-3
Ligand
BDBM50464126
Substrate
Meas. Tech.
ChEMBL_1432678 (CHEMBL3389922)
IC50
1.1±n/a nM
Citation
 Adams, JAnderson, ECBlackham, EEChiu, YWClarke, TEccles, NGill, LAHaye, JJHaywood, HTHoenig, CRKausas, MLe, JRussell, HLSmedley, CTipping, WJTongue, TWood, CCYeung, JRowedder, JEFray, MJMcInally, TMacdonald, SJ Structure Activity Relationships of ?v Integrin Antagonists for Pulmonary Fibrosis by Variation in Aryl Substituents. ACS Med Chem Lett 5:1207-12 (2014)  
Target
Name:
Integrin alpha-V/beta-3
Synonyms:
ITGAV/ITGB3 | Integrin beta-3/Vitronectin receptor alpha
Type:
Enzyme
Mol. Mass.:
Description:
Components:
This complex has 2 components.
Component 1
Name:
Integrin alpha-V
Synonyms:
ITAV_HUMAN Integrin alpha-V/alpha-5 VNRA Vitronectin receptor | Vitronectin receptor subunit alpha
Type:
PROTEIN
Mol. Mass.:
116024.92
Organism:
Homo sapiens (Human)
Description:
ChEMBL_582336
Residue:
1048
  
Component 2
Name:
Integrin beta-3
Synonyms:
CD_antigen=CD61 GPIIIa ITGB3 Platelet membrane glycoprotein IIIa
Type:
Protein
Mol. Mass.:
87038.91
Organism:
Homo sapiens (Human)
Description:
P05106
Residue:
788
  
Inhibitor
Name:
BDBM50464126
Synonyms:
CHEMBL3356154
Type:
Small organic molecule
Emp. Form.:
C19H19Cl2N5O4
Mol. Mass.:
452.291
SMILES:
NC(=N)Nc1cccc(c1)C(=O)NCC(=O)NC(CC(O)=O)c1cc(Cl)cc(Cl)c1
: