Target
Integrin alpha-V/beta-3
Ligand
BDBM50497606
Substrate
Meas. Tech.
ChEMBL_1432668 (CHEMBL3389383)
IC50
25±n/a nM
Citation
 Adams, JAnderson, ECBlackham, EEChiu, YWClarke, TEccles, NGill, LAHaye, JJHaywood, HTHoenig, CRKausas, MLe, JRussell, HLSmedley, CTipping, WJTongue, TWood, CCYeung, JRowedder, JEFray, MJMcInally, TMacdonald, SJ Structure Activity Relationships of ?v Integrin Antagonists for Pulmonary Fibrosis by Variation in Aryl Substituents. ACS Med Chem Lett 5:1207-12 (2014)  
Target
Name:
Integrin alpha-V/beta-3
Synonyms:
ITGAV/ITGB3 | Integrin beta-3/Vitronectin receptor alpha
Type:
Enzyme
Mol. Mass.:
Description:
Components:
This complex has 2 components.
Component 1
Name:
Integrin alpha-V
Synonyms:
ITAV_HUMAN Integrin alpha-V/alpha-5 VNRA Vitronectin receptor | Vitronectin receptor subunit alpha
Type:
PROTEIN
Mol. Mass.:
116024.92
Organism:
Homo sapiens (Human)
Description:
ChEMBL_582336
Residue:
1048
  
Component 2
Name:
Integrin beta-3
Synonyms:
CD_antigen=CD61 GPIIIa ITGB3 Platelet membrane glycoprotein IIIa
Type:
Protein
Mol. Mass.:
87038.91
Organism:
Homo sapiens (Human)
Description:
P05106
Residue:
788
  
Inhibitor
Name:
BDBM50497606
Synonyms:
CHEMBL3356166
Type:
Small organic molecule
Emp. Form.:
C23H29N3O4
Mol. Mass.:
411.4941
SMILES:
COc1ccc(cc1)C(CC(O)=O)NC(=O)CCCCc1ccc2CCCNc2n1
: