Target
Integrin alpha-V/beta-5
Ligand
BDBM50497618
Substrate
Meas. Tech.
ChEMBL_1432669 (CHEMBL3389384)
IC50
20±n/a nM
Citation
 Adams, JAnderson, ECBlackham, EEChiu, YWClarke, TEccles, NGill, LAHaye, JJHaywood, HTHoenig, CRKausas, MLe, JRussell, HLSmedley, CTipping, WJTongue, TWood, CCYeung, JRowedder, JEFray, MJMcInally, TMacdonald, SJ Structure Activity Relationships of ?v Integrin Antagonists for Pulmonary Fibrosis by Variation in Aryl Substituents. ACS Med Chem Lett 5:1207-12 (2014)  
Target
Name:
Integrin alpha-V/beta-5
Synonyms:
ITGAV/ITGB5 | Integrin beta-5/Vitronectin receptor alpha
Type:
Enzyme
Mol. Mass.:
Description:
Components:
This complex has 2 components.
Component 1
Name:
Integrin alpha-V
Synonyms:
ITAV_HUMAN Integrin alpha-V/alpha-5 VNRA Vitronectin receptor | Vitronectin receptor subunit alpha
Type:
PROTEIN
Mol. Mass.:
116024.92
Organism:
Homo sapiens (Human)
Description:
ChEMBL_582336
Residue:
1048
  
Component 2
Name:
Integrin beta-5
Synonyms:
ITB5_HUMAN | ITGB5
Type:
PROTEIN
Mol. Mass.:
88047.37
Organism:
Homo sapiens (Human)
Description:
EBI_10915
Residue:
799
  
Inhibitor
Name:
BDBM50497618
Synonyms:
CHEMBL3356158
Type:
Small organic molecule
Emp. Form.:
C23H29N3O3
Mol. Mass.:
395.4947
SMILES:
Cc1ccccc1C(CC(O)=O)NC(=O)CCCCc1ccc2CCCNc2n1
: