Target
S-adenosylmethionine decarboxylase proenzyme
Ligand
BDBM50046197
Substrate
Meas. Tech.
ChEBML_197689
IC50
6±n/a nM
Citation
 Stanek, JCaravatti, GCapraro, HGFuret, PMett, HSchneider, PRegenass, U S-adenosylmethionine decarboxylase inhibitors: new aryl and heteroaryl analogues of methylglyoxal bis(guanylhydrazone). J Med Chem 36:46-54 (1993)  
Target
Name:
S-adenosylmethionine decarboxylase proenzyme
Synonyms:
Amd1 S-adenosylmethionine decarboxylase 1
Type:
PROTEIN
Mol. Mass.:
38134.93
Organism:
Rattus norvegicus
Description:
ChEMBL_197052
Residue:
333
  
Inhibitor
Name:
BDBM50046197
Synonyms:
4-{3-[(Z)-amino(imino)methyl]phenyl}pyrimidine-2-carboximidamide | CHEMBL151222
Type:
Small organic molecule
Emp. Form.:
C12H12N6
Mol. Mass.:
240.2639
SMILES:
NC(=N)c1cccc(c1)-c1ccnc(n1)C(N)=N
: