Target
Angiotensin-converting enzyme
Ligand
BDBM50038615
Substrate
Meas. Tech.
ChEMBL_36743 (CHEMBL646967)
IC50
4000±n/a nM
Citation
 Gomez-Monterrey, ITurcaud, SLucas, EBruetschy, LRoques, BPFournié-Zaluski, MC Exploration of neutral endopeptidase active site by a series of new thiol-containing inhibitors. J Med Chem 36:87-94 (1993)  
Target
Name:
Angiotensin-converting enzyme
Synonyms:
ACE Angiotensin converting enzyme (ACE) Angiotensin-converting enzyme, soluble form CD_antigen=CD143 DCP1 Kininase II
Type:
Enzyme
Mol. Mass.:
149709.01
Organism:
Homo sapiens (Human)
Description:
Residue:
1306
  
Inhibitor
Name:
BDBM50038615
Synonyms:
2-(2-Benzyl-3-mercapto-5-phenyl-pentanoylamino)-propionic acid | CHEMBL54601
Type:
Small organic molecule
Emp. Form.:
C21H25NO3S
Mol. Mass.:
371.493
SMILES:
CC(NC(=O)C(Cc1ccccc1)C(S)CCc1ccccc1)C(O)=O
: