Target
Angiotensin-converting enzyme
Ligand
BDBM50046261
Substrate
Meas. Tech.
ChEMBL_36743 (CHEMBL646967)
IC50
10000±n/a nM
Citation
 Gomez-Monterrey, ITurcaud, SLucas, EBruetschy, LRoques, BPFournié-Zaluski, MC Exploration of neutral endopeptidase active site by a series of new thiol-containing inhibitors. J Med Chem 36:87-94 (1993)  
Target
Name:
Angiotensin-converting enzyme
Synonyms:
ACE Angiotensin converting enzyme (ACE) Angiotensin-converting enzyme, soluble form CD_antigen=CD143 DCP1 Kininase II
Type:
Enzyme
Mol. Mass.:
149709.01
Organism:
Homo sapiens (Human)
Description:
Residue:
1306
  
Inhibitor
Name:
BDBM50046261
Synonyms:
2-(3-Mercapto-5-methyl-hexanoylamino)-3-phenyl-propionic acid CHEMBL173287
Type:
Small organic molecule
Emp. Form.:
C16H23NO3S
Mol. Mass.:
309.424
SMILES:
CC(C)CC(S)CC(=O)NC(Cc1ccccc1)C(O)=O
: