Target
Neuronal acetylcholine receptor subunit alpha-3/alpha-6/beta-2/beta-3
Ligand
BDBM50498041
Substrate
Meas. Tech.
ChEMBL_1451540 (CHEMBL3365061)
EC50
300±n/a nM
Citation
 Strachan, JPKombo, DCMazurov, AHeemstra, RBhatti, BSAkireddy, RMurthy, SMiao, LJett, JESpeake, JBencherif, M Identification and pharmacological characterization of 3,6-diazabicyclo[3.1.1]heptane-3-carboxamides as novel ligands for the ?4?2 and ?6/?3?2?3 nicotinic acetylcholine receptors (nAChRs). Eur J Med Chem 86:60-74 (2014)  
Target
Name:
Neuronal acetylcholine receptor subunit alpha-3/alpha-6/beta-2/beta-3
Synonyms:
Neuronal acetylcholine receptor protein beta-2 subunit/protein beta-3 subunit/subunit alpha-3/subunit alpha-6 | Neuronal acetylcholine receptor; alpha3/alpha6/beta2/beta3
Type:
Mol. Mass.:
Description:
ASSAY_ID of EBI is 306494
Components:
This complex has 4 components.
Component 1
Name:
Neuronal acetylcholine receptor subunit beta-3
Synonyms:
ACHB3_HUMAN Neuronal acetylcholine receptor protein beta-3 subunit | Neuronal acetylcholine receptor subunit beta-3
Type:
PROTEIN
Mol. Mass.:
52736.06
Organism:
Homo sapiens (Human)
Description:
EBI_10025
Residue:
458
  
Component 2
Name:
Neuronal acetylcholine receptor subunit beta-2
Synonyms:
ACHB2_HUMAN Neuronal acetylcholine receptor protein beta-2 subunit | Nicotinic acetylcholine receptor alpha3/beta2/alpha5
Type:
Protein
Mol. Mass.:
57020.50
Organism:
Homo sapiens (Human)
Description:
P17787
Residue:
502
  
Component 3
Name:
Neuronal acetylcholine receptor subunit alpha-3
Synonyms:
ACHA3_HUMAN Cholinergic, Nicotinic Alpha3Beta2 Cholinergic, Nicotinic Alpha3Beta4x NACHRA3 Neuronal acetylcholine receptor subunit alpha-3 nicotinic central
Type:
Enzyme Catalytic Domain
Mol. Mass.:
57479.03
Organism:
Homo sapiens (Human)
Description:
Cholinergic, Nicotinic Alpha3Beta2 0 HUMAN::P32297
Residue:
505
  
Component 4
Name:
Neuronal acetylcholine receptor subunit alpha-6
Synonyms:
ACHA6_HUMAN Neuronal acetylcholine receptor protein alpha-6 subunit
Type:
PROTEIN
Mol. Mass.:
56898.54
Organism:
Homo sapiens (Human)
Description:
EBI_12774
Residue:
494
  
Inhibitor
Name:
BDBM50498041
Synonyms:
CHEMBL3329531
Type:
Small organic molecule
Emp. Form.:
C9H16N2O
Mol. Mass.:
168.2361
SMILES:
CCCC(=O)N1CC2CC(C1)N2
: