Target
Nuclear factor erythroid 2-related factor 2
Ligand
BDBM50006932
Substrate
Meas. Tech.
ChEMBL_1474110 (CHEMBL3424043)
IC50
29±n/a nM
Citation
 Richardson, BGJain, ADSpeltz, TEMoore, TW Non-electrophilic modulators of the canonical Keap1/Nrf2 pathway. Bioorg Med Chem Lett 25:2261-8 (2015)  
Target
Name:
Nuclear factor erythroid 2-related factor 2
Synonyms:
HEBP1 NF-E2-related factor 2 NFE2-related factor 2 NRF2 Nuclear factor, erythroid derived 2, like 2
Type:
PROTEIN
Mol. Mass.:
67786.89
Organism:
Homo sapiens (Human)
Description:
ChEMBL_107924
Residue:
605
  
Inhibitor
Name:
BDBM50006932
Synonyms:
CHEMBL3237245
Type:
Small organic molecule
Emp. Form.:
C28H26N2O10S2
Mol. Mass.:
614.643
SMILES:
COc1ccc(cc1)S(=O)(=O)N(CC(O)=O)c1ccc(N(CC(O)=O)S(=O)(=O)c2ccc(OC)cc2)c2ccccc12
: