Target
Voltage-dependent L-type calcium channel subunit alpha-1C
Ligand
BDBM50046765
Substrate
Meas. Tech.
ChEMBL_42744 (CHEMBL656260)
IC50
540±n/a nM
Citation
 Dei, SRomanelli, MNScapecchi, STeodori, EGualtieri, FChiarini, AVoigt, WLemoine, H Verapamil analogues with restricted molecular flexibility: synthesis and pharmacological evaluation of the four isomers of alpha-[1-[3-[N-[1- [2-(3,4-dimethoxyphenyl)ethyl]]-N-methylamino]cyclohexyl]]-alpha- isopropyl-3,4-dimethoxybenzene-acetonitrile. J Med Chem 36:439-45 (1993)  
Target
Name:
Voltage-dependent L-type calcium channel subunit alpha-1C
Synonyms:
CAC1C_HUMAN CACN2 CACNL1A1 Calcium channel (Type L) L-type calcium channel alpha-1c/beta-2/alpha2delta-1 Voltage-gated L-type calcium channel Voltage-gated calcium channel | Voltage-gated calcium channel subunit alpha Cav1.2
Type:
Enzyme Catalytic Domain
Mol. Mass.:
248979.79
Organism:
Homo sapiens (Human)
Description:
Calcium channel (Type L) 0 HUMAN::Q13936
Residue:
2221
  
Inhibitor
Name:
BDBM50046765
Synonyms:
(RRR) 2-(3,4-Dimethoxy-phenyl)-2-{3-[2-(3,4-dimethoxy-phenyl)-ethylamino]-cyclohexyl}-3-methyl-butyronitrile (RSR) 2-(3,4-Dimethoxy-phenyl)-2-{3-[2-(3,4-dimethoxy-phenyl)-ethylamino]-cyclohexyl}-3-methyl-butyronitrile CHEMBL343771
Type:
Small organic molecule
Emp. Form.:
C29H40N2O4
Mol. Mass.:
480.6389
SMILES:
COc1ccc(CCNC2CCCC(C2)C(C#N)(C(C)C)c2ccc(OC)c(OC)c2)cc1OC
: