Target
Nitric oxide synthase, brain
Ligand
BDBM344409
Substrate
Meas. Tech.
ChEMBL_1539117 (CHEMBL3738625)
Ki
712±n/a nM
Citation
 Cinelli, MALi, HPensa, AVKang, SRoman, LJMartásek, PPoulos, TLSilverman, RB Phenyl Ether- and Aniline-Containing 2-Aminoquinolines as Potent and Selective Inhibitors of Neuronal Nitric Oxide Synthase. J Med Chem 58:8694-712 (2015)  
Target
Name:
Nitric oxide synthase, brain
Synonyms:
Bnos NC-NOS NOS type I nNOS Neuronal nitric oxide synthase Nitric Oxide Synthase, brain Nitric oxide synthase, brain (nNOS) Nitric-oxide synthase, brain (nNOS) Nos1 | Peptidyl-cysteine S-nitrosylase NOS1
Type:
Enzyme
Mol. Mass.:
160570.98
Organism:
Rattus norvegicus (rat)
Description:
Recombinant nNOS overexpressed in E. coli was used in enzyme assays.
Residue:
1429
  
Inhibitor
Name:
BDBM344409
Synonyms:
US9783500, Compound 5
Type:
Small organic molecule
Emp. Form.:
C15H13N3O
Mol. Mass.:
251.2832
SMILES:
Nc1ccc2ccc(COc3cccnc3)cc2n1
: